НАГОРЬЕ
type: LexicalConcept
hypernym: http://lod.ruthes.org/resource/concept/100108
hyponym: http://lod.ruthes.org/resource/concept/105151
hyponym: http://lod.ruthes.org/resource/concept/129273
definition: обширный по площади участок земной поверхности, представляющий сочетание плоскогорий, горных хребтов и массивов, иногда чередующихся с котловинами, плато и долинами и в целом расположенный сравнительно высоко над уровнем моря
in scheme: ruthes
lexicalized sense: 100106-нагорье-n-0