ПЛОСКОГОРЬЕ
type: LexicalConcept
hypernym: http://lod.ruthes.org/resource/concept/100108
hypernym: http://lod.ruthes.org/resource/concept/5657
hyponym: http://lod.ruthes.org/resource/concept/9568
definition: обширная возвышенность с равнинной или холмистой поверхностью
in scheme: ruthes
lexicalized sense: 100109-плоскогорный-adj-0
lexicalized sense: 100109-плоскогорье-n-0