ДЬЯКОН
type: LexicalConcept
hypernym: http://lod.ruthes.org/resource/concept/7365
hypernym: http://lod.ruthes.org/resource/concept/8029
hyponym: http://lod.ruthes.org/resource/concept/110861
hyponym: http://lod.ruthes.org/resource/concept/137214
definition: в православии и католицизме — священнослужитель, имеющий первую, низшую степень священства
in scheme: ruthes
lexicalized sense: 10061-диакон-n-0
lexicalized sense: 10061-дьякон-n-0
lexicalized sense: 10061-дьяконский-adj-0