НАЗНАЧЕНИЕ НА ДОЛЖНОСТЬ
type: LexicalConcept
association1: http://lod.ruthes.org/resource/concept/889
association2: http://lod.ruthes.org/resource/concept/8018
hypernym: http://lod.ruthes.org/resource/concept/111944
hypernym: http://lod.ruthes.org/resource/concept/115487
hypernym: http://lod.ruthes.org/resource/concept/888
hyponym: http://lod.ruthes.org/resource/concept/117937
meronym: http://lod.ruthes.org/resource/concept/144521
definition: Определять кого-л. для каких-л. занятий, направлять на какую-л. должность, работу.
in scheme: ruthes
lexicalized sense: 10172-возложение исполнения обязанностей-ng-0
lexicalized sense: 10172-возложение обязанностей-ng-0
lexicalized sense: 10172-возложить временное исполнение обязанностей-vg-0
lexicalized sense: 10172-возложить исполнение обязанностей-vg-0
lexicalized sense: 10172-возложить обязанности-vg-0
lexicalized sense: 10172-замещение вакантной должности-ng-0
lexicalized sense: 10172-избрать для работы-vg-0
lexicalized sense: 10172-кадровые назначения-ng-0
lexicalized sense: 10172-назначать-v-0
lexicalized sense: 10172-назначать на пост-vg-0
lexicalized sense: 10172-назначение-n-0
lexicalized sense: 10172-назначение на должность-ng-0
lexicalized sense: 10172-назначение на новую должность-ng-0
lexicalized sense: 10172-назначение на пост-ng-0
lexicalized sense: 10172-назначить-v-0
lexicalized sense: 10172-назначить на должность-vg-0
lexicalized sense: 10172-назначить на новую должность-vg-0
lexicalized sense: 10172-назначить на пост-vg-0
lexicalized sense: 10172-согласовать кандидатуру-vg-0
lexicalized sense: 10172-утвердить в должности-vg-0
lexicalized sense: 10172-утвердить на должность-vg-0
lexicalized sense: 10172-утверждать на должность-vg-0
lexicalized sense: 10172-утверждение на должность-ng-0