ГУБЕРНАТОР
type: LexicalConcept
association2: http://lod.ruthes.org/resource/concept/135071
hypernym: http://lod.ruthes.org/resource/concept/136561
meronym: http://lod.ruthes.org/resource/concept/136373
definition: глава области, губернии, штата, провинции и т.п.
in scheme: ruthes
lexicalized sense: 10275-губернатор-n-0
lexicalized sense: 10275-губернаторский-adj-0