ХИРУРГ
type: LexicalConcept
holonym: http://lod.ruthes.org/resource/concept/1064
hypernym: http://lod.ruthes.org/resource/concept/1045
hyponym: http://lod.ruthes.org/resource/concept/111070
hyponym: http://lod.ruthes.org/resource/concept/113027
hyponym: http://lod.ruthes.org/resource/concept/126783
hyponym: http://lod.ruthes.org/resource/concept/145273
hyponym: http://lod.ruthes.org/resource/concept/152995
definition: врач, специализирующийся в области хирургии
in scheme: ruthes
lexicalized sense: 1046-хирург-n-0