МЕДИЦИНА
type: LexicalConcept
association1: http://lod.ruthes.org/resource/concept/3406
association2: http://lod.ruthes.org/resource/concept/145284
holonym: http://lod.ruthes.org/resource/concept/612
hypernym: http://lod.ruthes.org/resource/concept/106562
hyponym: http://lod.ruthes.org/resource/concept/10056
hyponym: http://lod.ruthes.org/resource/concept/10105
hyponym: http://lod.ruthes.org/resource/concept/1058
hyponym: http://lod.ruthes.org/resource/concept/1064
hyponym: http://lod.ruthes.org/resource/concept/1071
hyponym: http://lod.ruthes.org/resource/concept/111546
hyponym: http://lod.ruthes.org/resource/concept/113479
hyponym: http://lod.ruthes.org/resource/concept/113534
hyponym: http://lod.ruthes.org/resource/concept/113587
hyponym: http://lod.ruthes.org/resource/concept/123681
hyponym: http://lod.ruthes.org/resource/concept/126844
hyponym: http://lod.ruthes.org/resource/concept/133820
hyponym: http://lod.ruthes.org/resource/concept/134951
hyponym: http://lod.ruthes.org/resource/concept/136967
hyponym: http://lod.ruthes.org/resource/concept/138981
hyponym: http://lod.ruthes.org/resource/concept/141061
hyponym: http://lod.ruthes.org/resource/concept/147007
hyponym: http://lod.ruthes.org/resource/concept/5161
hyponym: http://lod.ruthes.org/resource/concept/5184
hyponym: http://lod.ruthes.org/resource/concept/5263
hyponym: http://lod.ruthes.org/resource/concept/5264
hyponym: http://lod.ruthes.org/resource/concept/5804
hyponym: http://lod.ruthes.org/resource/concept/5961
hyponym: http://lod.ruthes.org/resource/concept/6143
hyponym: http://lod.ruthes.org/resource/concept/6202
hyponym: http://lod.ruthes.org/resource/concept/6518
hyponym: http://lod.ruthes.org/resource/concept/7513
hyponym: http://lod.ruthes.org/resource/concept/7970
hyponym: http://lod.ruthes.org/resource/concept/8120
hyponym: http://lod.ruthes.org/resource/concept/8215
hyponym: http://lod.ruthes.org/resource/concept/8441
hyponym: http://lod.ruthes.org/resource/concept/8642
hyponym: http://lod.ruthes.org/resource/concept/8763
hyponym: http://lod.ruthes.org/resource/concept/8975
hyponym: http://lod.ruthes.org/resource/concept/9007
hyponym: http://lod.ruthes.org/resource/concept/9228
hyponym: http://lod.ruthes.org/resource/concept/9232
hyponym: http://lod.ruthes.org/resource/concept/9273
hyponym: http://lod.ruthes.org/resource/concept/9464
hyponym: http://lod.ruthes.org/resource/concept/9554
hyponym: http://lod.ruthes.org/resource/concept/9867
meronym: http://lod.ruthes.org/resource/concept/1037
meronym: http://lod.ruthes.org/resource/concept/1044
meronym: http://lod.ruthes.org/resource/concept/1062
meronym: http://lod.ruthes.org/resource/concept/1069
meronym: http://lod.ruthes.org/resource/concept/118812
meronym: http://lod.ruthes.org/resource/concept/149151
meronym: http://lod.ruthes.org/resource/concept/2977
meronym: http://lod.ruthes.org/resource/concept/2982
meronym: http://lod.ruthes.org/resource/concept/4465
meronym: http://lod.ruthes.org/resource/concept/46
meronym: http://lod.ruthes.org/resource/concept/4951
meronym: http://lod.ruthes.org/resource/concept/5177
definition: область научной и практической деятельности, связанная с охраной здоровья, изучением, предотвращением и лечением заболеваний и травм
in scheme: ruthes
lexicalized sense: 1047-медицина-n-0
lexicalized sense: 1047-медицинская сфера-ng-0
lexicalized sense: 1047-медицинский-adj-0