ГИГИЕНА (НАУКА)
type: LexicalConcept
association1: http://lod.ruthes.org/resource/concept/1052
association1: http://lod.ruthes.org/resource/concept/9127
hypernym: http://lod.ruthes.org/resource/concept/46
definition: область медицины, изучающая влияние условий жизни и труда на здоровье человека и разрабатывающая меры (санитарные нормы, правила и др.), направленные на предупреждение заболеваний, обеспечение оптимальных условий существования, укрепление здоровья и продление жизни
in scheme: ruthes
lexicalized sense: 1050-гигиена-n-0
lexicalized sense: 1050-гигиенический-adj-0
lexicalized sense: 1050-гигиеничный-adj-0
lexicalized sense: 1050-санитария-n-0