АРАБЫ
type: LexicalConcept
association: http://lod.ruthes.org/resource/concept/105456
association2: http://lod.ruthes.org/resource/concept/126924
hypernym: http://lod.ruthes.org/resource/concept/106131
hypernym: http://lod.ruthes.org/resource/concept/134850
hyponym: http://lod.ruthes.org/resource/concept/105424
hyponym: http://lod.ruthes.org/resource/concept/105426
hyponym: http://lod.ruthes.org/resource/concept/105431
hyponym: http://lod.ruthes.org/resource/concept/105442
hyponym: http://lod.ruthes.org/resource/concept/105450
hyponym: http://lod.ruthes.org/resource/concept/105463
hyponym: http://lod.ruthes.org/resource/concept/105488
hyponym: http://lod.ruthes.org/resource/concept/105496
hyponym: http://lod.ruthes.org/resource/concept/105511
hyponym: http://lod.ruthes.org/resource/concept/106313
hyponym: http://lod.ruthes.org/resource/concept/125182
hyponym: http://lod.ruthes.org/resource/concept/126571
hyponym: http://lod.ruthes.org/resource/concept/130116
hyponym: http://lod.ruthes.org/resource/concept/139649
definition: представитель одного из семитских народов, издавна населявших Ближний Восток и Северную Африку
in scheme: ruthes
lexicalized sense: 105413-араб-n-0
lexicalized sense: 105413-арабка-n-0
lexicalized sense: 105413-арабский-adj-0