БАШКИРЫ
type: LexicalConcept
association2: http://lod.ruthes.org/resource/concept/100391
association2: http://lod.ruthes.org/resource/concept/146085
hypernym: http://lod.ruthes.org/resource/concept/106148
hypernym: http://lod.ruthes.org/resource/concept/139862
hypernym: http://lod.ruthes.org/resource/concept/3291
definition: представитель народа, составляющего коренное население Башкирии
in scheme: ruthes
lexicalized sense: 105558-башкир-n-0
lexicalized sense: 105558-башкирка-n-0