КАЛМЫКИ
type: LexicalConcept
association2: http://lod.ruthes.org/resource/concept/101137
association2: http://lod.ruthes.org/resource/concept/148179
hypernym: http://lod.ruthes.org/resource/concept/106169
hypernym: http://lod.ruthes.org/resource/concept/139862
hypernym: http://lod.ruthes.org/resource/concept/3291
definition: представитель народа монгольской этноязыковой группы, составляющего коренное население Северного Прикаспия
in scheme: ruthes
lexicalized sense: 105562-калмык-n-0
lexicalized sense: 105562-калмыкский-adj-0
lexicalized sense: 105562-калмычка-n-0