АБХАЗЫ
type: LexicalConcept
association2: http://lod.ruthes.org/resource/concept/100754
association2: http://lod.ruthes.org/resource/concept/148149
hypernym: http://lod.ruthes.org/resource/concept/106198
hypernym: http://lod.ruthes.org/resource/concept/139862
definition: представитель народа, населяющего Абхазию, выходец из Абхазии или потомок таких выходцев
in scheme: ruthes
lexicalized sense: 105566-абхаз-n-0
lexicalized sense: 105566-абхазец-n-0
lexicalized sense: 105566-абхазка-n-0