МАРИЙЦЫ
type: LexicalConcept
association2: http://lod.ruthes.org/resource/concept/101879
association2: http://lod.ruthes.org/resource/concept/148171
hypernym: http://lod.ruthes.org/resource/concept/106181
hypernym: http://lod.ruthes.org/resource/concept/139862
hypernym: http://lod.ruthes.org/resource/concept/3291
definition: представитель народа финно-угорской этноязыковой группы, составляющего коренное население республики Марий Эл
in scheme: ruthes
lexicalized sense: 105568-мариец-n-0
lexicalized sense: 105568-марийка-n-0