БАЛКАРЦЫ
type: LexicalConcept
holonym: http://lod.ruthes.org/resource/concept/105305
hypernym: http://lod.ruthes.org/resource/concept/100046
hypernym: http://lod.ruthes.org/resource/concept/106148
definition: представитель народа тюркской этноязыковой группы, составляющий коренное население южной и юго-западной части Кабардино-Балкарии
in scheme: ruthes
lexicalized sense: 106154-балкарец-n-0
lexicalized sense: 106154-балкарка-n-0
lexicalized sense: 106154-балкарский-adj-0