ГАГАУЗЫ
type: LexicalConcept
association: http://lod.ruthes.org/resource/concept/101984
association: http://lod.ruthes.org/resource/concept/142077
hypernym: http://lod.ruthes.org/resource/concept/100046
hypernym: http://lod.ruthes.org/resource/concept/106148
definition: народ тюркской этноязыковой группы, живущий в Молдавии, на Украине, а также в Болгарии и Румынии
in scheme: ruthes
lexicalized sense: 106161-гагауз-n-0
lexicalized sense: 106161-гагаузка-n-0
lexicalized sense: 106161-гагаузский-adj-0