КОМИ
type: LexicalConcept
association2: http://lod.ruthes.org/resource/concept/101386
hypernym: http://lod.ruthes.org/resource/concept/106181
hypernym: http://lod.ruthes.org/resource/concept/139862
hypernym: http://lod.ruthes.org/resource/concept/3291
definition: народ в Российской Федерации, коренное население Республики Коми
in scheme: ruthes
lexicalized sense: 106182-зырянин-n-0
lexicalized sense: 106182-зырянка-n-0
lexicalized sense: 106182-зырянский-adj-0
lexicalized sense: 106182-коми-n-0
lexicalized sense: 106182-народ коми-ng-0