КОМИ-ПЕРМЯКИ
type: LexicalConcept
association2: http://lod.ruthes.org/resource/concept/101401
hypernym: http://lod.ruthes.org/resource/concept/106181
hypernym: http://lod.ruthes.org/resource/concept/139862
definition: представительница одной из двух близкородственных национальных групп финно-угорского народа коми, компактно проживающей в Пермском крае
in scheme: ruthes
lexicalized sense: 106183-коми-пермяк-n-0
lexicalized sense: 106183-коми-пермяцкий-adj-0
lexicalized sense: 106183-коми-пермячка-n-0
lexicalized sense: 106183-пермяк-n-0
lexicalized sense: 106183-пермяцкий-adj-0
lexicalized sense: 106183-пермячка-n-0