ИНГУШИ
type: LexicalConcept
association2: http://lod.ruthes.org/resource/concept/105311
association2: http://lod.ruthes.org/resource/concept/148156
hypernym: http://lod.ruthes.org/resource/concept/139862
hypernym: http://lod.ruthes.org/resource/concept/143651
hypernym: http://lod.ruthes.org/resource/concept/3291
definition: представитель северокавказского народа, составляющего коренное население Ингушетии
in scheme: ruthes
lexicalized sense: 106203-ингуш-n-0
lexicalized sense: 106203-ингушка-n-0