АДЫГЕЙЦЫ
type: LexicalConcept
association: http://lod.ruthes.org/resource/concept/100126
association2: http://lod.ruthes.org/resource/concept/148151
hypernym: http://lod.ruthes.org/resource/concept/100046
hypernym: http://lod.ruthes.org/resource/concept/105557
hypernym: http://lod.ruthes.org/resource/concept/3291
definition: уроженец или житель Адыгеи, представитель народа, составляющего коренное населении Адыгеи
in scheme: ruthes
lexicalized sense: 106211-адыгеец-n-0
lexicalized sense: 106211-адыгейка-n-0
lexicalized sense: 106211-адыгейский-adj-0