МЫСЛЬ, ДУМА
type: LexicalConcept
association2: http://lod.ruthes.org/resource/concept/131357
association2: http://lod.ruthes.org/resource/concept/142004
association2: http://lod.ruthes.org/resource/concept/149009
association2: http://lod.ruthes.org/resource/concept/149657
holonym: http://lod.ruthes.org/resource/concept/106467
hypernym: http://lod.ruthes.org/resource/concept/143290
definition: часть внутреннего мира человека, незавершённый продукт деятельности ума, возникающий независимо от воли человека в результате тяжёлого и медленного, обычно неоднократно возобновляемого осмысления чего-либо; мысль, размышление, раздумье
in scheme: ruthes
lexicalized sense: 106469-дума-n-0
lexicalized sense: 106469-думка-n-0
lexicalized sense: 106469-мысленный-adj-0
lexicalized sense: 106469-мысль-n-0
lexicalized sense: 106469-размышление-n-0