ЧУВСТВО, ЭМОЦИЯ
type: LexicalConcept
association2: http://lod.ruthes.org/resource/concept/106564
association2: http://lod.ruthes.org/resource/concept/116365
association2: http://lod.ruthes.org/resource/concept/116921
association2: http://lod.ruthes.org/resource/concept/119187
association2: http://lod.ruthes.org/resource/concept/123840
association2: http://lod.ruthes.org/resource/concept/124438
association2: http://lod.ruthes.org/resource/concept/124868
association2: http://lod.ruthes.org/resource/concept/129300
association2: http://lod.ruthes.org/resource/concept/139734
association2: http://lod.ruthes.org/resource/concept/139858
association2: http://lod.ruthes.org/resource/concept/142004
association2: http://lod.ruthes.org/resource/concept/142535
association2: http://lod.ruthes.org/resource/concept/143248
association2: http://lod.ruthes.org/resource/concept/143692
association2: http://lod.ruthes.org/resource/concept/144897
association2: http://lod.ruthes.org/resource/concept/145796
association2: http://lod.ruthes.org/resource/concept/147584
association2: http://lod.ruthes.org/resource/concept/148998
association2: http://lod.ruthes.org/resource/concept/149767
association2: http://lod.ruthes.org/resource/concept/150016
association2: http://lod.ruthes.org/resource/concept/150025
association2: http://lod.ruthes.org/resource/concept/152483
hypernym: http://lod.ruthes.org/resource/concept/143290
hyponym: http://lod.ruthes.org/resource/concept/106476
hyponym: http://lod.ruthes.org/resource/concept/106652
hyponym: http://lod.ruthes.org/resource/concept/106653
hyponym: http://lod.ruthes.org/resource/concept/106656
hyponym: http://lod.ruthes.org/resource/concept/106657
hyponym: http://lod.ruthes.org/resource/concept/106658
hyponym: http://lod.ruthes.org/resource/concept/106661
hyponym: http://lod.ruthes.org/resource/concept/106664
hyponym: http://lod.ruthes.org/resource/concept/106680
hyponym: http://lod.ruthes.org/resource/concept/106833
hyponym: http://lod.ruthes.org/resource/concept/106968
hyponym: http://lod.ruthes.org/resource/concept/107058
hyponym: http://lod.ruthes.org/resource/concept/107065
hyponym: http://lod.ruthes.org/resource/concept/107143
hyponym: http://lod.ruthes.org/resource/concept/107215
hyponym: http://lod.ruthes.org/resource/concept/107281
hyponym: http://lod.ruthes.org/resource/concept/113147
hyponym: http://lod.ruthes.org/resource/concept/113772
hyponym: http://lod.ruthes.org/resource/concept/115080
hyponym: http://lod.ruthes.org/resource/concept/115848
hyponym: http://lod.ruthes.org/resource/concept/116103
hyponym: http://lod.ruthes.org/resource/concept/117029
hyponym: http://lod.ruthes.org/resource/concept/118022
hyponym: http://lod.ruthes.org/resource/concept/118117
hyponym: http://lod.ruthes.org/resource/concept/118303
hyponym: http://lod.ruthes.org/resource/concept/118926
hyponym: http://lod.ruthes.org/resource/concept/119065
hyponym: http://lod.ruthes.org/resource/concept/121127
hyponym: http://lod.ruthes.org/resource/concept/125745
hyponym: http://lod.ruthes.org/resource/concept/125932
hyponym: http://lod.ruthes.org/resource/concept/135450
hyponym: http://lod.ruthes.org/resource/concept/136603
hyponym: http://lod.ruthes.org/resource/concept/138455
hyponym: http://lod.ruthes.org/resource/concept/138600
hyponym: http://lod.ruthes.org/resource/concept/140744
hyponym: http://lod.ruthes.org/resource/concept/146417
hyponym: http://lod.ruthes.org/resource/concept/147105
hyponym: http://lod.ruthes.org/resource/concept/150105
hyponym: http://lod.ruthes.org/resource/concept/150296
hyponym: http://lod.ruthes.org/resource/concept/151324
hyponym: http://lod.ruthes.org/resource/concept/151395
hyponym: http://lod.ruthes.org/resource/concept/153245
meronym: http://lod.ruthes.org/resource/concept/119868
definition: внутреннее чувство человека, душевное волнение
in scheme: ruthes
lexicalized sense: 106651-внутреннее ощущение-ng-0
lexicalized sense: 106651-движение души-ng-0
lexicalized sense: 106651-душевное переживание-ng-0
lexicalized sense: 106651-ощущение-n-0
lexicalized sense: 106651-переживание-n-0
lexicalized sense: 106651-чувство-n-0
lexicalized sense: 106651-эмоциональный-adj-0
lexicalized sense: 106651-эмоция-n-0