НЕПРИЯЗНЬ
type: LexicalConcept
association: http://lod.ruthes.org/resource/concept/106670
association: http://lod.ruthes.org/resource/concept/115440
association: http://lod.ruthes.org/resource/concept/118987
association2: http://lod.ruthes.org/resource/concept/117111
association2: http://lod.ruthes.org/resource/concept/118573
association2: http://lod.ruthes.org/resource/concept/133498
hypernym: http://lod.ruthes.org/resource/concept/106647
hypernym: http://lod.ruthes.org/resource/concept/106651
hyponym: http://lod.ruthes.org/resource/concept/106654
hyponym: http://lod.ruthes.org/resource/concept/118919
hyponym: http://lod.ruthes.org/resource/concept/118984
hyponym: http://lod.ruthes.org/resource/concept/119551
hyponym: http://lod.ruthes.org/resource/concept/127218
hyponym: http://lod.ruthes.org/resource/concept/127279
hyponym: http://lod.ruthes.org/resource/concept/140594
meronym: http://lod.ruthes.org/resource/concept/123517
definition: недружелюбное, враждебное отношение к кому-либо или чему-либо
in scheme: ruthes
lexicalized sense: 106653-антипатия-n-0
lexicalized sense: 106653-не жаловать-vg-0
lexicalized sense: 106653-недоброжелательность-n-0
lexicalized sense: 106653-недружелюбие-n-0
lexicalized sense: 106653-недружелюбный-adj-0
lexicalized sense: 106653-недружественный-adj-0
lexicalized sense: 106653-нелюбовь-n-0
lexicalized sense: 106653-неприязненное отношение-ng-0
lexicalized sense: 106653-неприязненность-n-0
lexicalized sense: 106653-неприязненный-adj-0
lexicalized sense: 106653-неприязнь-n-0
lexicalized sense: 106653-нерасположение-n-0