ЧУВСТВО СЧАСТЬЯ
type: LexicalConcept
hypernym: http://lod.ruthes.org/resource/concept/106651
hyponym: http://lod.ruthes.org/resource/concept/120848
definition: радостное состояние с ощущением полного удовлетворения
in scheme: ruthes
lexicalized sense: 106658-на седьмом небе от счастья-prepg-0
lexicalized sense: 106658-счастье-n-0
lexicalized sense: 106658-чувство счастья-ng-0