ОГОРЧЕНИЕ
type: LexicalConcept
association2: http://lod.ruthes.org/resource/concept/110478
association2: http://lod.ruthes.org/resource/concept/117162
hypernym: http://lod.ruthes.org/resource/concept/106661
hyponym: http://lod.ruthes.org/resource/concept/115891
definition: чувство горечи; неприятность; расстройство
in scheme: ruthes
lexicalized sense: 106663-горючий-adj-0
lexicalized sense: 106663-огорчение-n-0
lexicalized sense: 106663-расстроенный-adj-0
lexicalized sense: 106663-расстройство-n-0