ОБЩЕСТВО, ОБЪЕДИНЕНИЕ
type: LexicalConcept
hypernym: http://lod.ruthes.org/resource/concept/111488
hypernym: http://lod.ruthes.org/resource/concept/2260
hyponym: http://lod.ruthes.org/resource/concept/130559
hyponym: http://lod.ruthes.org/resource/concept/133234
hyponym: http://lod.ruthes.org/resource/concept/142578
hyponym: http://lod.ruthes.org/resource/concept/145188
hyponym: http://lod.ruthes.org/resource/concept/7262
definition: объединение лиц, учреждений, организаций и т. п. для достижения общей цели
in scheme: ruthes
lexicalized sense: 106667-ассоциация-n-0
lexicalized sense: 106667-общество-n-0
lexicalized sense: 106667-объединение-n-0
lexicalized sense: 106667-сообщество-n-0
lexicalized sense: 106667-союз-n-0