ИСТРАТИТЬ, ИЗРАСХОДОВАТЬ
type: LexicalConcept
association2: http://lod.ruthes.org/resource/concept/112027
association2: http://lod.ruthes.org/resource/concept/139846
hypernym: http://lod.ruthes.org/resource/concept/106497
hyponym: http://lod.ruthes.org/resource/concept/111873
hyponym: http://lod.ruthes.org/resource/concept/112165
hyponym: http://lod.ruthes.org/resource/concept/112475
hyponym: http://lod.ruthes.org/resource/concept/112635
hyponym: http://lod.ruthes.org/resource/concept/112734
hyponym: http://lod.ruthes.org/resource/concept/112867
hyponym: http://lod.ruthes.org/resource/concept/113256
hyponym: http://lod.ruthes.org/resource/concept/113654
hyponym: http://lod.ruthes.org/resource/concept/117589
hyponym: http://lod.ruthes.org/resource/concept/117605
hyponym: http://lod.ruthes.org/resource/concept/120358
hyponym: http://lod.ruthes.org/resource/concept/130449
hyponym: http://lod.ruthes.org/resource/concept/147852
hyponym: http://lod.ruthes.org/resource/concept/148677
definition: утрата каких-либо припасов или средств в процессе их использования
in scheme: ruthes
lexicalized sense: 106715-затрата-n-0
lexicalized sense: 106715-затратить-v-0
lexicalized sense: 106715-затрачивание-n-0
lexicalized sense: 106715-затрачивать-v-0
lexicalized sense: 106715-израсходование-n-0
lexicalized sense: 106715-израсходовать-v-0
lexicalized sense: 106715-израсходоваться-v-0
lexicalized sense: 106715-использование средств-ng-0
lexicalized sense: 106715-истратить-v-0
lexicalized sense: 106715-истратиться-v-0
lexicalized sense: 106715-кончаться-v-0
lexicalized sense: 106715-кончиться-v-0
lexicalized sense: 106715-поистратиться-v-0
lexicalized sense: 106715-понести затраты-vg-0
lexicalized sense: 106715-понести расходы-vg-0
lexicalized sense: 106715-потратить-v-0
lexicalized sense: 106715-растратить-v-0
lexicalized sense: 106715-растратиться-v-0
lexicalized sense: 106715-растрачивание-n-0
lexicalized sense: 106715-растрачивать-v-0
lexicalized sense: 106715-расход-n-0
lexicalized sense: 106715-расходование-n-0
lexicalized sense: 106715-расходовать-v-0
lexicalized sense: 106715-расходоваться-v-0
lexicalized sense: 106715-тратить-v-0
lexicalized sense: 106715-тратиться-v-0