ВРЕМЯ, МОМЕНТ ВРЕМЕНИ
type: LexicalConcept
association2: http://lod.ruthes.org/resource/concept/115977
association2: http://lod.ruthes.org/resource/concept/150212
holonym: http://lod.ruthes.org/resource/concept/106720
hypernym: http://lod.ruthes.org/resource/concept/106768
hyponym: http://lod.ruthes.org/resource/concept/114433
hyponym: http://lod.ruthes.org/resource/concept/137732
hyponym: http://lod.ruthes.org/resource/concept/143643
definition: конкретный момент, отдельная уникальная конфигурация вселенной, точка на оси времени в значении
in scheme: ruthes
lexicalized sense: 106722-время-n-0
lexicalized sense: 106722-данный момент-ng-0
lexicalized sense: 106722-момент времени-ng-0