ВЫСОТА (ЛИНЕЙНЫЙ РАЗМЕР)
type: LexicalConcept
association2: http://lod.ruthes.org/resource/concept/106773
association2: http://lod.ruthes.org/resource/concept/106843
association2: http://lod.ruthes.org/resource/concept/137522
hypernym: http://lod.ruthes.org/resource/concept/106717
hyponym: http://lod.ruthes.org/resource/concept/118535
meronym: http://lod.ruthes.org/resource/concept/114018
meronym: http://lod.ruthes.org/resource/concept/114335
definition: размер по вертикали, расстояние от верхней до нижней точки
in scheme: ruthes
lexicalized sense: 106756-высота-n-0
lexicalized sense: 106756-высотный-adj-0
lexicalized sense: 106756-высотный параметр-ng-0
lexicalized sense: 106756-вышина-n-0