СПОСОБНОСТЬ
type: LexicalConcept
association2: http://lod.ruthes.org/resource/concept/118295
association2: http://lod.ruthes.org/resource/concept/138312
association2: http://lod.ruthes.org/resource/concept/138351
association2: http://lod.ruthes.org/resource/concept/141995
association2: http://lod.ruthes.org/resource/concept/153087
association2: http://lod.ruthes.org/resource/concept/154403
hypernym: http://lod.ruthes.org/resource/concept/106768
hyponym: http://lod.ruthes.org/resource/concept/106766
hyponym: http://lod.ruthes.org/resource/concept/106767
hyponym: http://lod.ruthes.org/resource/concept/117098
hyponym: http://lod.ruthes.org/resource/concept/117866
hyponym: http://lod.ruthes.org/resource/concept/117962
hyponym: http://lod.ruthes.org/resource/concept/118022
hyponym: http://lod.ruthes.org/resource/concept/119434
hyponym: http://lod.ruthes.org/resource/concept/123740
hyponym: http://lod.ruthes.org/resource/concept/123902
hyponym: http://lod.ruthes.org/resource/concept/130061
hyponym: http://lod.ruthes.org/resource/concept/130827
hyponym: http://lod.ruthes.org/resource/concept/133375
hyponym: http://lod.ruthes.org/resource/concept/133752
hyponym: http://lod.ruthes.org/resource/concept/144008
hyponym: http://lod.ruthes.org/resource/concept/148509
hyponym: http://lod.ruthes.org/resource/concept/149947
hyponym: http://lod.ruthes.org/resource/concept/150475
hyponym: http://lod.ruthes.org/resource/concept/154941
hyponym: http://lod.ruthes.org/resource/concept/3182
hyponym: http://lod.ruthes.org/resource/concept/6185
definition: свойство, позволяющее кому-то или чему-то осуществить какое-либо действие.
in scheme: ruthes
lexicalized sense: 106765-способность-n-0
lexicalized sense: 106765-способный-adj-0