ВОСПОМИНАНИЕ
type: LexicalConcept
association2: http://lod.ruthes.org/resource/concept/106807
association2: http://lod.ruthes.org/resource/concept/118499
association2: http://lod.ruthes.org/resource/concept/125932
association2: http://lod.ruthes.org/resource/concept/129232
association2: http://lod.ruthes.org/resource/concept/146677
holonym: http://lod.ruthes.org/resource/concept/106805
hypernym: http://lod.ruthes.org/resource/concept/107543
hypernym: http://lod.ruthes.org/resource/concept/143290
definition: то, что сохранилось в памяти; мысленное воспроизведение чего-либо прошедшего, сохранившегося в памяти
in scheme: ruthes
lexicalized sense: 106806-воспоминание-n-0
lexicalized sense: 106806-картина прошлого-ng-0
lexicalized sense: 106806-память-n-0