ОПАСЕНИЕ
type: LexicalConcept
association1: http://lod.ruthes.org/resource/concept/106547
hypernym: http://lod.ruthes.org/resource/concept/106791
definition: предчувствие опасности или каких-либо негативных событий
in scheme: ruthes
lexicalized sense: 106834-опасение-n-0