АНОНС
type: LexicalConcept
holonym: http://lod.ruthes.org/resource/concept/106838
hypernym: http://lod.ruthes.org/resource/concept/106836
definition: предварительное объявление (без подробностей) о предстоящем спектакле, концерте итп
in scheme: ruthes
lexicalized sense: 106837-анонс-n-0