ЗАКАЗАТЬ, СДЕЛАТЬ ЗАКАЗ
type: LexicalConcept
association2: http://lod.ruthes.org/resource/concept/135060
holonym: http://lod.ruthes.org/resource/concept/106529
hypernym: http://lod.ruthes.org/resource/concept/106866
hyponym: http://lod.ruthes.org/resource/concept/121060
hyponym: http://lod.ruthes.org/resource/concept/6582
meronym: http://lod.ruthes.org/resource/concept/106864
meronym: http://lod.ruthes.org/resource/concept/143652
definition: поручение кому-либо изготовления чего-либо или исполнения какой-либо работы за оплату
in scheme: ruthes
lexicalized sense: 106865-делать заказ-vg-0
lexicalized sense: 106865-заказ-n-0
lexicalized sense: 106865-заказать-v-0
lexicalized sense: 106865-заказной-adj-0
lexicalized sense: 106865-заказывание-n-0
lexicalized sense: 106865-заказывать-v-0
lexicalized sense: 106865-сделать заказ-vg-0