ПОХВАЛА
type: LexicalConcept
holonym: http://lod.ruthes.org/resource/concept/107125
hypernym: http://lod.ruthes.org/resource/concept/107127
hyponym: http://lod.ruthes.org/resource/concept/113241
hyponym: http://lod.ruthes.org/resource/concept/134461
hyponym: http://lod.ruthes.org/resource/concept/145201
definition: лестный, положительный отзыв о ком-либо, чём-либо, высказываемое одобрение кого-либо, чего-либо
in scheme: ruthes
lexicalized sense: 107126-похвала-n-0
lexicalized sense: 107126-похвальность-n-0
lexicalized sense: 107126-похвальный-adj-0