ВОПРОС (ОБРАЩЕНИЕ)
type: LexicalConcept
association2: http://lod.ruthes.org/resource/concept/107256
association2: http://lod.ruthes.org/resource/concept/120754
association2: http://lod.ruthes.org/resource/concept/125733
hypernym: http://lod.ruthes.org/resource/concept/106459
definition: высказывание, обращение к кому-либо для получения ответа, например с целью получения информации
in scheme: ruthes
lexicalized sense: 107255-вопрос-n-0
lexicalized sense: 107255-вопросик-n-0