КОНФЛИКТ
type: LexicalConcept
association2: http://lod.ruthes.org/resource/concept/139733
hypernym: http://lod.ruthes.org/resource/concept/107213
hyponym: http://lod.ruthes.org/resource/concept/107214
hyponym: http://lod.ruthes.org/resource/concept/121086
hyponym: http://lod.ruthes.org/resource/concept/124609
hyponym: http://lod.ruthes.org/resource/concept/124880
hyponym: http://lod.ruthes.org/resource/concept/136138
hyponym: http://lod.ruthes.org/resource/concept/151895
hyponym: http://lod.ruthes.org/resource/concept/1671
hyponym: http://lod.ruthes.org/resource/concept/1673
hyponym: http://lod.ruthes.org/resource/concept/2225
hyponym: http://lod.ruthes.org/resource/concept/8415
hyponym: http://lod.ruthes.org/resource/concept/869
meronym: http://lod.ruthes.org/resource/concept/106830
meronym: http://lod.ruthes.org/resource/concept/107507
definition: столкновение противоположных сторон, мнений, сил; серьёзное разногласие
in scheme: ruthes
lexicalized sense: 107328-идти на конфликт-vg-0
lexicalized sense: 107328-конфликт-n-0
lexicalized sense: 107328-конфликтная ситуация-ng-0
lexicalized sense: 107328-конфликтность-n-0
lexicalized sense: 107328-конфликтные отношения-ng-0
lexicalized sense: 107328-конфликтный-adj-0
lexicalized sense: 107328-конфликтовать-v-0
lexicalized sense: 107328-конфронтационность-n-0
lexicalized sense: 107328-конфронтационный-adj-0
lexicalized sense: 107328-конфронтация-n-0
lexicalized sense: 107328-конфронтировать-v-0
lexicalized sense: 107328-ситуация конфликта-ng-0