РЕКОМЕНДАЦИЯ (СОВЕТ)
type: LexicalConcept
hypernym: http://lod.ruthes.org/resource/concept/106840
definition: то же, что совет, пожелание или предписание, высказанное в необязательной форме
in scheme: ruthes
lexicalized sense: 107353-рекомендация-n-0