ПРИКАЗ (РАСПОРЯЖЕНИЕ)
type: LexicalConcept
holonym: http://lod.ruthes.org/resource/concept/107373
hypernym: http://lod.ruthes.org/resource/concept/106447
hyponym: http://lod.ruthes.org/resource/concept/107372
hyponym: http://lod.ruthes.org/resource/concept/117732
hyponym: http://lod.ruthes.org/resource/concept/147630
definition: обращение к кому-либо с требованием сделать, выполнить что-либо; указание о выполнении чего-либо; распоряжение
in scheme: ruthes
lexicalized sense: 107371-директива-n-0
lexicalized sense: 107371-директивный-adj-0
lexicalized sense: 107371-повеление-n-0
lexicalized sense: 107371-предписание-n-0
lexicalized sense: 107371-приказ-n-0
lexicalized sense: 107371-приказание-n-0