ПРОСТОР, РАЗДОЛЬЕ
type: LexicalConcept
hypernym: http://lod.ruthes.org/resource/concept/106610
hypernym: http://lod.ruthes.org/resource/concept/123619
definition: широкое, ничем не ограниченное пространство, равнина
in scheme: ruthes
lexicalized sense: 107378-даль-n-0
lexicalized sense: 107378-приволье-n-0
lexicalized sense: 107378-простор-n-0
lexicalized sense: 107378-просторный-adj-0
lexicalized sense: 107378-раздолье-n-0
lexicalized sense: 107378-ширь-n-0