ДЕФЕКТ
type: LexicalConcept
hypernym: http://lod.ruthes.org/resource/concept/106499
hyponym: http://lod.ruthes.org/resource/concept/107088
hyponym: http://lod.ruthes.org/resource/concept/143259
hyponym: http://lod.ruthes.org/resource/concept/149544
definition: изъян, порча, повреждение; недостаток, несовершенство
in scheme: ruthes
lexicalized sense: 107499-дефект-n-0
lexicalized sense: 107499-дефектный-adj-0