ПОСЛОВИЦА
type: LexicalConcept
hypernym: http://lod.ruthes.org/resource/concept/107368
definition: краткое образное законченное изречение, обычно ритмичное по форме, с назидательным смыслом
in scheme: ruthes
lexicalized sense: 107523-пословица-n-0
lexicalized sense: 107523-пословичный-adj-0