ОБРАЗ (ПРЕДСТАВЛЕНИЕ)
type: LexicalConcept
association1: http://lod.ruthes.org/resource/concept/107545
holonym: http://lod.ruthes.org/resource/concept/106804
holonym: http://lod.ruthes.org/resource/concept/106805
hypernym: http://lod.ruthes.org/resource/concept/143290
hyponym: http://lod.ruthes.org/resource/concept/106806
hyponym: http://lod.ruthes.org/resource/concept/107452
hyponym: http://lod.ruthes.org/resource/concept/107544
hyponym: http://lod.ruthes.org/resource/concept/129447
hyponym: http://lod.ruthes.org/resource/concept/138563
hyponym: http://lod.ruthes.org/resource/concept/138575
hyponym: http://lod.ruthes.org/resource/concept/146628
definition: воспроизведенное памятью и вызванное в сознании ощущение
in scheme: ruthes
lexicalized sense: 107543-мысленное представление-ng-0
lexicalized sense: 107543-мысленный-adj-0
lexicalized sense: 107543-мысленный образ-ng-0
lexicalized sense: 107543-образ-n-0
lexicalized sense: 107543-образный-adj-0
lexicalized sense: 107543-представление-n-0