РАССУЖДЕНИЕ (ВЫСКАЗЫВАНИЕ)
type: LexicalConcept
holonym: http://lod.ruthes.org/resource/concept/107604
hypernym: http://lod.ruthes.org/resource/concept/107257
definition: высказывания, обсуждение, разговор, обмен мнениями
in scheme: ruthes
lexicalized sense: 107605-рассуждение-n-0