СКАЗАНИЕ
type: LexicalConcept
hypernym: http://lod.ruthes.org/resource/concept/107658
hypernym: http://lod.ruthes.org/resource/concept/1448
hyponym: http://lod.ruthes.org/resource/concept/107660
hyponym: http://lod.ruthes.org/resource/concept/107691
hyponym: http://lod.ruthes.org/resource/concept/112463
hyponym: http://lod.ruthes.org/resource/concept/125498
definition: жанр устного народного творчества о событиях прошлого или современности, в котором повествование ведется от лица рассказчика; также произведение такого жанра
in scheme: ruthes
lexicalized sense: 107659-народное сказание-ng-0
lexicalized sense: 107659-сказ-n-0
lexicalized sense: 107659-сказание-n-0
lexicalized sense: 107659-сказовый-adj-0