ПАНИКА
type: LexicalConcept
association1: http://lod.ruthes.org/resource/concept/135128
association2: http://lod.ruthes.org/resource/concept/133580
hypernym: http://lod.ruthes.org/resource/concept/106792
definition: проявление неконтролируемого страха, как правило, в группе индивидуумов
in scheme: ruthes
lexicalized sense: 107713-паника-n-0
lexicalized sense: 107713-панический-adj-0