ФОЙЕ
type: LexicalConcept
association1: http://lod.ruthes.org/resource/concept/107517
holonym: http://lod.ruthes.org/resource/concept/1417
hypernym: http://lod.ruthes.org/resource/concept/106573
definition: помещение в театре, кинотеатре и т. п., предназначенное для пребывания зрителей в ожидании сеанса, спектакля, а также для отдыха публики во время антракта
in scheme: ruthes
lexicalized sense: 108522-фойе-n-0
lexicalized sense: 108522-холл-n-0