НОВОВВЕДЕНИЕ
type: LexicalConcept
hypernym: http://lod.ruthes.org/resource/concept/106450
hypernym: http://lod.ruthes.org/resource/concept/132964
definition: что-либо вновь введенное, принятое; новшество
in scheme: ruthes
lexicalized sense: 108668-нововведение-n-0