АМПЛИТУДА
type: LexicalConcept
holonym: http://lod.ruthes.org/resource/concept/107513
hypernym: http://lod.ruthes.org/resource/concept/106841
definition: максимальное значение изменения переменной величины или смещения при колебательном или волновом движении.
in scheme: ruthes
lexicalized sense: 108913-амплитуда-n-0
lexicalized sense: 108913-амплитуда движения-ng-0
lexicalized sense: 108913-амплитуда колебаний-ng-0
lexicalized sense: 108913-амплитудный-adj-0
lexicalized sense: 108913-размах-n-0
lexicalized sense: 108913-размах движения-ng-0
lexicalized sense: 108913-размах колебаний-ng-0