ПОКРОЙ, ФАСОН
type: LexicalConcept
association2: http://lod.ruthes.org/resource/concept/111861
holonym: http://lod.ruthes.org/resource/concept/1256
hypernym: http://lod.ruthes.org/resource/concept/106559
hyponym: http://lod.ruthes.org/resource/concept/131915
hyponym: http://lod.ruthes.org/resource/concept/134737
definition: вид, придаваемый одежде с помощью выкраивания
in scheme: ruthes
lexicalized sense: 108928-крой-n-0
lexicalized sense: 108928-крой одежды-ng-0
lexicalized sense: 108928-покрой-n-0
lexicalized sense: 108928-покрой одежды-ng-0
lexicalized sense: 108928-фасон-n-0
lexicalized sense: 108928-фасон одежды-ng-0
lexicalized sense: 108928-фасонный-adj-0
lexicalized sense: 108928-фасончик-n-0