БОРОДА
type: LexicalConcept
holonym: http://lod.ruthes.org/resource/concept/134864
hypernym: http://lod.ruthes.org/resource/concept/148805
definition: у человека мужского пола и некоторых животных — волосяной покров нижней части лица
in scheme: ruthes
lexicalized sense: 108950-борода-n-0
lexicalized sense: 108950-бородка-n-0
lexicalized sense: 108950-растительность на подбородке-ng-0